{"text_format":"1","workbook":"xlsx","n_sheets":10,"sheets":["Algemeen","Leidingsgroep","vb. sloebers","niet gebruikt 1","niet gebruikt 2","niet gebruikt 3","niet gebruikt 4","niet gebruikt 5","niet gebruikt 6","Postcode"],"not_rendered":{"charts":0,"images":0,"macros":1,"external_links":0,"defined_names":0,"comments":0,"pivot_tables":0},"unopened":[],"bounds":{"document_bytes":16777216,"sheet_cells":100000,"rows_first":2000,"rows_last":500,"rows_between":2000,"halvings":0,"cell_chars":16384,"cell_head_chars":4096},"cells_cut":0,"cells_raw":0,"read":"whole","date_system":"1900"}

{"sheet":"Algemeen","index":0,"n_rows":22,"n_cols":16,"rows_kept":22,"cut":false,"hidden":false,"merged":[[0,0,0,4],[18,0,18,6],[19,0,19,6],[20,0,20,6],[21,0,21,6],[12,0,12,5],[13,0,13,5]]}
["Ledenlijst voor erkenningsaanvraag/subsidieaanvraag jeugdvereniging:",null,null,null,null,null,null,null,null,null,null,null,null,null,null,"Algemeen"]
[]
[null,"Naam leeftijdsgroep","van … tot … jaar oud","aantal leden"]
["leeftijdsgroep 1","vb. sloebers","vb. 6 tot 8",{"$f":"COUNTIF('vb. sloebers'!$P$4:$P$102,4)","v":0},null,"Naam jeugdvereniging:"]
["leeftijdsgroep 2","niet gebruikt 1",null,{"$f":"COUNTIF('niet gebruikt 1'!$P$4:$P$102,4)","v":0}]
["leeftijdsgroep 3","niet gebruikt 2",null,{"$f":"COUNTIF('niet gebruikt 2'!$P$4:$P$102,4)","v":0}]
["leeftijdsgroep 4","niet gebruikt 3",null,{"$f":"COUNTIF('niet gebruikt 3'!$P$4:$P$102,4)","v":0}]
["leeftijdsgroep 5","niet gebruikt 4",null,{"$f":"COUNTIF('niet gebruikt 4'!$P$4:$P$102,4)","v":0},null,null,"Totaal aantal leden:",{"$f":"SUM(D4:D10)","v":0}]
["leeftijdsgroep 6","niet gebruikt 5",null,{"$f":"COUNTIF('niet gebruikt 5'!$P$4:$P$102,4)","v":0},null,null,"Totaal aantal leden incl. begeleiders",{"$f":"SUM(D4:D11)","v":0}]
["leeftijdsgroep 7","niet gebruikt 6",null,{"$f":"COUNTIF('niet gebruikt 6'!$P$4:$P$102,4)","v":0}]
{"$rows_left_out":13}
{"sheet":"Leidingsgroep","index":1,"n_rows":102,"n_cols":16,"rows_kept":102,"cut":false,"hidden":false,"merged":[[0,0,0,7]]}
["Gegevens Leiding",null,null,null,null,null,null,null,null,null,null,null,null,null,null,"Leidingsgroep"]
["Naam","Voornaam","Geboortedatum","Straat","Nr°/Bus","Postcode","Gemeente","Controle"]
["vb. Evenepoel","vb. Remco","1990-04-03","Vogelzangstraat","37/3",3540,{"$f":"_xlfn.XLOOKUP(F3,Postcode!$A$2:$A$2766,Postcode!$D$2:$D$2766,\"postcode klopt niet\",0)","v":"HERK-DE-STAD"}]
[null,null,null,null,null,null,{"$f":"_xlfn.XLOOKUP(F4,Postcode!$A$2:$A$2766,Postcode!$D$2:$D$2766,\"postcode klopt niet\",0)","v":"postcode klopt niet"},{"$f":"COUNTA(A4,B4,C4,F4)","v":0}]
[null,null,null,null,null,null,{"$f":"_xlfn.XLOOKUP(F5,Postcode!$A$2:$A$2766,Postcode!$D$2:$D$2766,\"postcode klopt niet\",0)","v":"postcode klopt niet"},{"$f":"COUNTA(A5,B5,C5,F5)","v":0}]
[null,null,null,null,null,null,{"$f":"_xlfn.XLOOKUP(F6,Postcode!$A$2:$A$2766,Postcode!$D$2:$D$2766,\"postcode klopt niet\",0)","v":"postcode klopt niet"},0]
[null,null,null,null,null,null,{"$f":"_xlfn.XLOOKUP(F7,Postcode!$A$2:$A$2766,Postcode!$D$2:$D$2766,\"postcode klopt niet\",0)","v":"postcode klopt niet"},0]
[null,null,null,null,null,null,{"$f":"_xlfn.XLOOKUP(F8,Postcode!$A$2:$A$2766,Postcode!$D$2:$D$2766,\"postcode klopt niet\",0)","v":"postcode klopt niet"},0]
[null,null,null,null,null,null,{"$f":"_xlfn.XLOOKUP(F9,Postcode!$A$2:$A$2766,Postcode!$D$2:$D$2766,\"postcode klopt niet\",0)","v":"postcode klopt niet"},0]
[null,null,null,null,null,null,{"$f":"_xlfn.XLOOKUP(F10,Postcode!$A$2:$A$2766,Postcode!$D$2:$D$2766,\"postcode klopt niet\",0)","v":"postcode klopt niet"},0]
{"$rows_left_out":93}
{"sheet":"vb. sloebers","index":2,"n_rows":102,"n_cols":16,"rows_kept":102,"cut":false,"hidden":false,"merged":[[0,0,0,7],[0,8,0,14]]}
["Gegevens Lid",null,null,null,null,null,null,null,"Gegevens Ouder/Voogd ( in geval van gescheiden ouders degene die betaalt)",null,null,null,null,null,null,{"$f":"Algemeen!B4","v":"vb. sloebers"}]
["Naam","Voornaam","Rijksregisternr° (00.00.00-000.00)","Geboortedatum","Straat","Nr°/Bus","Postcode","Gemeente","Naam","Voornaam","Rijksregisternr° (00.00.00-000.00)","Straat","Nr°/Bus","Postcode","Gemeente","Controle"]
["vb. Evenepoel","vb. Remco","93.04.07-131.88",{"$f":"DATE((IF(VALUE((RIGHT(SUBSTITUTE(SUBSTITUTE(C3,\".\",\"\"),\"-\",\"\"),2)))=(97-(MOD(LEFT(SUBSTITUTE(SUBSTITUTE(C3,\".\",\"\"),\"-\",\"\"),9),97))),1900+(LEFT(SUBSTITUTE(SUBSTITUTE(C3,\".\",\"\"),\"-\",\"\"),2)),2000+(LEFT(SUBSTITUTE(SUBSTITUTE(C3,\".\",\"\"),\"-\",\"\"),2)))),(MID(SUBSTITUTE(SUBSTITUTE(C3,\".\",\"\"),\"-\",\"\"),3,2)),(MID(SUBSTITUTE(SUBSTITUTE(C3,\".\",\"\"),\"-\",\"\"),5,2)))","v":"1993-04-07"},"Vogelzangstraat","37/3",3540,{"$f":"_xlfn.XLOOKUP(G3,Postcode!$A$2:$A$2766,Postcode!$D$2:$D$2766,\"postcode klopt niet\",0)","v":"HERK-DE-STAD"},"vb. Evenepoel","vb. Patrick","66.03.17-144.48","Parklaan",23,3800,{"$f":"_xlfn.XLOOKUP(N3,Postcode!$A$2:$A$2766,Postcode!$D$2:$D$2766,\"postcode klopt niet\",0)","v":"SINT-TRUIDEN"}]
[null,null,null,{"$error":"#VALUE!"},null,null,null,{"$f":"_xlfn.XLOOKUP(G4,Postcode!$A$2:$A$2766,Postcode!$D$2:$D$2766,\"postcode klopt niet\",0)","v":"postcode klopt niet"},null,null,null,null,null,null,{"$f":"_xlfn.XLOOKUP(N4,Postcode!$A$2:$A$2766,Postcode!$D$2:$D$2766,\"postcode klopt niet\",0)","v":"postcode klopt niet"},{"$f":"COUNTA(A4,B4,D4,G4)","v":1}]
[null,null,null,{"$error":"#VALUE!"},null,null,null,{"$f":"_xlfn.XLOOKUP(G5,Postcode!$A$2:$A$2766,Postcode!$D$2:$D$2766,\"postcode klopt niet\",0)","v":"postcode klopt niet"},null,null,null,null,null,null,{"$f":"_xlfn.XLOOKUP(N5,Postcode!$A$2:$A$2766,Postcode!$D$2:$D$2766,\"postcode klopt niet\",0)","v":"postcode klopt niet"},{"$f":"COUNTA(A5,B5,D5,G5)","v":1}]
[null,null,null,{"$error":"#VALUE!"},null,null,null,{"$f":"_xlfn.XLOOKUP(G6,Postcode!$A$2:$A$2766,Postcode!$D$2:$D$2766,\"postcode klopt niet\",0)","v":"postcode klopt niet"},null,null,null,null,null,null,{"$f":"_xlfn.XLOOKUP(N6,Postcode!$A$2:$A$2766,Postcode!$D$2:$D$2766,\"postcode klopt niet\",0)","v":"postcode klopt niet"},1]
[null,null,null,{"$error":"#VALUE!"},null,null,null,{"$f":"_xlfn.XLOOKUP(G7,Postcode!$A$2:$A$2766,Postcode!$D$2:$D$2766,\"postcode klopt niet\",0)","v":"postcode klopt niet"},null,null,null,null,null,null,{"$f":"_xlfn.XLOOKUP(N7,Postcode!$A$2:$A$2766,Postcode!$D$2:$D$2766,\"postcode klopt niet\",0)","v":"postcode klopt niet"},1]
[null,null,null,{"$error":"#VALUE!"},null,null,null,{"$f":"_xlfn.XLOOKUP(G8,Postcode!$A$2:$A$2766,Postcode!$D$2:$D$2766,\"postcode klopt niet\",0)","v":"postcode klopt niet"},null,null,null,null,null,null,{"$f":"_xlfn.XLOOKUP(N8,Postcode!$A$2:$A$2766,Postcode!$D$2:$D$2766,\"postcode klopt niet\",0)","v":"postcode klopt niet"},1]
[null,null,null,{"$error":"#VALUE!"},null,null,null,{"$f":"_xlfn.XLOOKUP(G9,Postcode!$A$2:$A$2766,Postcode!$D$2:$D$2766,\"postcode klopt niet\",0)","v":"postcode klopt niet"},null,null,null,null,null,null,{"$f":"_xlfn.XLOOKUP(N9,Postcode!$A$2:$A$2766,Postcode!$D$2:$D$2766,\"postcode klopt niet\",0)","v":"postcode klopt niet"},1]
[null,null,null,{"$error":"#VALUE!"},null,null,null,{"$f":"_xlfn.XLOOKUP(G10,Postcode!$A$2:$A$2766,Postcode!$D$2:$D$2766,\"postcode klopt niet\",0)","v":"postcode klopt niet"},null,null,null,null,null,null,{"$f":"_xlfn.XLOOKUP(N10,Postcode!$A$2:$A$2766,Postcode!$D$2:$D$2766,\"postcode klopt niet\",0)","v":"postcode klopt niet"},1]
{"$rows_left_out":93}
{"sheet":"niet gebruikt 1","index":3,"n_rows":109,"n_cols":16,"rows_kept":109,"cut":false,"hidden":false,"merged":[[0,0,0,7],[0,8,0,14]]}
["Gegevens Lid",null,null,null,null,null,null,null,"Gegevens Ouder/Voogd ( in geval van gescheiden ouders, degene die betaalt)",null,null,null,null,null,null,{"$f":"Algemeen!B5","v":"niet gebruikt 1"}]
["Naam","Voornaam","Rijksregisternr° (00.00.00-000.00)","Geboortedatum","Straat","Nr°/Bus","Postcode","Gemeente","Naam","Voornaam","Rijksregisternr° (00.00.00-000.00)","Straat","Nr°/Bus","Postcode","Gemeente","Controle"]
["vb. Evenepoel","vb. Remco","93.04.07-131.88",{"$f":"DATE((IF(VALUE((RIGHT(SUBSTITUTE(SUBSTITUTE(C3,\".\",\"\"),\"-\",\"\"),2)))=(97-(MOD(LEFT(SUBSTITUTE(SUBSTITUTE(C3,\".\",\"\"),\"-\",\"\"),9),97))),1900+(LEFT(SUBSTITUTE(SUBSTITUTE(C3,\".\",\"\"),\"-\",\"\"),2)),2000+(LEFT(SUBSTITUTE(SUBSTITUTE(C3,\".\",\"\"),\"-\",\"\"),2)))),(MID(SUBSTITUTE(SUBSTITUTE(C3,\".\",\"\"),\"-\",\"\"),3,2)),(MID(SUBSTITUTE(SUBSTITUTE(C3,\".\",\"\"),\"-\",\"\"),5,2)))","v":"1993-04-07"},"Vogelzangstraat","37/3",3540,{"$f":"_xlfn.XLOOKUP(G3,Postcode!$A$2:$A$2766,Postcode!$D$2:$D$2766,\"postcode klopt niet\",0)","v":"HERK-DE-STAD"},"vb. Evenepoel","vb. Patrick","66.03.17-144.48","Parklaan",23,3800,{"$f":"_xlfn.XLOOKUP(N3,Postcode!$A$2:$A$2766,Postcode!$D$2:$D$2766,\"postcode klopt niet\",0)","v":"SINT-TRUIDEN"}]
[null,null,null,{"$error":"#VALUE!"},null,null,null,{"$f":"_xlfn.XLOOKUP(G4,Postcode!$A$2:$A$2766,Postcode!$D$2:$D$2766,\"postcode klopt niet\",0)","v":"postcode klopt niet"},null,null,null,null,null,null,{"$f":"_xlfn.XLOOKUP(N4,Postcode!$A$2:$A$2766,Postcode!$D$2:$D$2766,\"postcode klopt niet\",0)","v":"postcode klopt niet"},{"$f":"COUNTA(A4,B4,D4,G4)","v":1}]
[null,null,null,{"$error":"#VALUE!"},null,null,null,{"$f":"_xlfn.XLOOKUP(G5,Postcode!$A$2:$A$2766,Postcode!$D$2:$D$2766,\"postcode klopt niet\",0)","v":"postcode klopt niet"},null,null,null,null,null,null,{"$f":"_xlfn.XLOOKUP(N5,Postcode!$A$2:$A$2766,Postcode!$D$2:$D$2766,\"postcode klopt niet\",0)","v":"postcode klopt niet"},{"$f":"COUNTA(A5,B5,D5,G5)","v":1}]
[null,null,null,{"$error":"#VALUE!"},null,null,null,{"$f":"_xlfn.XLOOKUP(G6,Postcode!$A$2:$A$2766,Postcode!$D$2:$D$2766,\"postcode klopt niet\",0)","v":"postcode klopt niet"},null,null,null,null,null,null,{"$f":"_xlfn.XLOOKUP(N6,Postcode!$A$2:$A$2766,Postcode!$D$2:$D$2766,\"postcode klopt niet\",0)","v":"postcode klopt niet"},1]
[null,null,null,{"$error":"#VALUE!"},null,null,null,{"$f":"_xlfn.XLOOKUP(G7,Postcode!$A$2:$A$2766,Postcode!$D$2:$D$2766,\"postcode klopt niet\",0)","v":"postcode klopt niet"},null,null,null,null,null,null,{"$f":"_xlfn.XLOOKUP(N7,Postcode!$A$2:$A$2766,Postcode!$D$2:$D$2766,\"postcode klopt niet\",0)","v":"postcode klopt niet"},1]
[null,null,null,{"$error":"#VALUE!"},null,null,null,{"$f":"_xlfn.XLOOKUP(G8,Postcode!$A$2:$A$2766,Postcode!$D$2:$D$2766,\"postcode klopt niet\",0)","v":"postcode klopt niet"},null,null,null,null,null,null,{"$f":"_xlfn.XLOOKUP(N8,Postcode!$A$2:$A$2766,Postcode!$D$2:$D$2766,\"postcode klopt niet\",0)","v":"postcode klopt niet"},1]
[null,null,null,{"$error":"#VALUE!"},null,null,null,{"$f":"_xlfn.XLOOKUP(G9,Postcode!$A$2:$A$2766,Postcode!$D$2:$D$2766,\"postcode klopt niet\",0)","v":"postcode klopt niet"},null,null,null,null,null,null,{"$f":"_xlfn.XLOOKUP(N9,Postcode!$A$2:$A$2766,Postcode!$D$2:$D$2766,\"postcode klopt niet\",0)","v":"postcode klopt niet"},1]
[null,null,null,{"$error":"#VALUE!"},null,null,null,{"$f":"_xlfn.XLOOKUP(G10,Postcode!$A$2:$A$2766,Postcode!$D$2:$D$2766,\"postcode klopt niet\",0)","v":"postcode klopt niet"},null,null,null,null,null,null,{"$f":"_xlfn.XLOOKUP(N10,Postcode!$A$2:$A$2766,Postcode!$D$2:$D$2766,\"postcode klopt niet\",0)","v":"postcode klopt niet"},1]
{"$rows_left_out":100}
{"sheet":"niet gebruikt 2","index":4,"n_rows":109,"n_cols":16,"rows_kept":109,"cut":false,"hidden":false,"merged":[[0,0,0,7],[0,8,0,14]]}
["Gegevens Lid",null,null,null,null,null,null,null,"Gegevens Ouder/Voogd ( in geval van gescheiden ouders, degene die betaalt)",null,null,null,null,null,null,{"$f":"Algemeen!B6","v":"niet gebruikt 2"}]
["Naam","Voornaam","Rijksregisternr° (00.00.00-000.00)","Geboortedatum","Straat","Nr°/Bus","Postcode","Gemeente","Naam","Voornaam","Rijksregisternr° (00.00.00-000.00)","Straat","Nr°/Bus","Postcode","Gemeente","Controle"]
["vb. Evenepoel","vb. Remco","93.04.07-131.88",{"$f":"DATE((IF(VALUE((RIGHT(SUBSTITUTE(SUBSTITUTE(C3,\".\",\"\"),\"-\",\"\"),2)))=(97-(MOD(LEFT(SUBSTITUTE(SUBSTITUTE(C3,\".\",\"\"),\"-\",\"\"),9),97))),1900+(LEFT(SUBSTITUTE(SUBSTITUTE(C3,\".\",\"\"),\"-\",\"\"),2)),2000+(LEFT(SUBSTITUTE(SUBSTITUTE(C3,\".\",\"\"),\"-\",\"\"),2)))),(MID(SUBSTITUTE(SUBSTITUTE(C3,\".\",\"\"),\"-\",\"\"),3,2)),(MID(SUBSTITUTE(SUBSTITUTE(C3,\".\",\"\"),\"-\",\"\"),5,2)))","v":"1993-04-07"},"Vogelzangstraat","37/3",3540,{"$f":"_xlfn.XLOOKUP(G3,Postcode!$A$2:$A$2766,Postcode!$D$2:$D$2766,\"postcode klopt niet\",0)","v":"HERK-DE-STAD"},"vb. Evenepoel","vb. Patrick","66.03.17-144.48","Parklaan",23,3800,{"$f":"_xlfn.XLOOKUP(N3,Postcode!$A$2:$A$2766,Postcode!$D$2:$D$2766,\"postcode klopt niet\",0)","v":"SINT-TRUIDEN"}]
[null,null,null,{"$error":"#VALUE!"},null,null,null,{"$f":"_xlfn.XLOOKUP(G4,Postcode!$A$2:$A$2766,Postcode!$D$2:$D$2766,\"postcode klopt niet\",0)","v":"postcode klopt niet"},null,null,null,null,null,null,{"$f":"_xlfn.XLOOKUP(N4,Postcode!$A$2:$A$2766,Postcode!$D$2:$D$2766,\"postcode klopt niet\",0)","v":"postcode klopt niet"},{"$f":"COUNTA(A4,B4,D4,G4)","v":1}]
[null,null,null,{"$error":"#VALUE!"},null,null,null,{"$f":"_xlfn.XLOOKUP(G5,Postcode!$A$2:$A$2766,Postcode!$D$2:$D$2766,\"postcode klopt niet\",0)","v":"postcode klopt niet"},null,null,null,null,null,null,{"$f":"_xlfn.XLOOKUP(N5,Postcode!$A$2:$A$2766,Postcode!$D$2:$D$2766,\"postcode klopt niet\",0)","v":"postcode klopt niet"},{"$f":"COUNTA(A5,B5,D5,G5)","v":1}]
[null,null,null,{"$error":"#VALUE!"},null,null,null,{"$f":"_xlfn.XLOOKUP(G6,Postcode!$A$2:$A$2766,Postcode!$D$2:$D$2766,\"postcode klopt niet\",0)","v":"postcode klopt niet"},null,null,null,null,null,null,{"$f":"_xlfn.XLOOKUP(N6,Postcode!$A$2:$A$2766,Postcode!$D$2:$D$2766,\"postcode klopt niet\",0)","v":"postcode klopt niet"},1]
[null,null,null,{"$error":"#VALUE!"},null,null,null,{"$f":"_xlfn.XLOOKUP(G7,Postcode!$A$2:$A$2766,Postcode!$D$2:$D$2766,\"postcode klopt niet\",0)","v":"postcode klopt niet"},null,null,null,null,null,null,{"$f":"_xlfn.XLOOKUP(N7,Postcode!$A$2:$A$2766,Postcode!$D$2:$D$2766,\"postcode klopt niet\",0)","v":"postcode klopt niet"},1]
[null,null,null,{"$error":"#VALUE!"},null,null,null,{"$f":"_xlfn.XLOOKUP(G8,Postcode!$A$2:$A$2766,Postcode!$D$2:$D$2766,\"postcode klopt niet\",0)","v":"postcode klopt niet"},null,null,null,null,null,null,{"$f":"_xlfn.XLOOKUP(N8,Postcode!$A$2:$A$2766,Postcode!$D$2:$D$2766,\"postcode klopt niet\",0)","v":"postcode klopt niet"},1]
[null,null,null,{"$error":"#VALUE!"},null,null,null,{"$f":"_xlfn.XLOOKUP(G9,Postcode!$A$2:$A$2766,Postcode!$D$2:$D$2766,\"postcode klopt niet\",0)","v":"postcode klopt niet"},null,null,null,null,null,null,{"$f":"_xlfn.XLOOKUP(N9,Postcode!$A$2:$A$2766,Postcode!$D$2:$D$2766,\"postcode klopt niet\",0)","v":"postcode klopt niet"},1]
[null,null,null,{"$error":"#VALUE!"},null,null,null,{"$f":"_xlfn.XLOOKUP(G10,Postcode!$A$2:$A$2766,Postcode!$D$2:$D$2766,\"postcode klopt niet\",0)","v":"postcode klopt niet"},null,null,null,null,null,null,{"$f":"_xlfn.XLOOKUP(N10,Postcode!$A$2:$A$2766,Postcode!$D$2:$D$2766,\"postcode klopt niet\",0)","v":"postcode klopt niet"},1]
{"$rows_left_out":100}
{"sheet":"niet gebruikt 3","index":5,"n_rows":109,"n_cols":16,"rows_kept":109,"cut":false,"hidden":false,"merged":[[0,0,0,7],[0,8,0,14]]}
["Gegevens Lid",null,null,null,null,null,null,null,"Gegevens Ouder/Voogd ( in geval van gescheiden ouders, degene die betaalt)",null,null,null,null,null,null,{"$f":"Algemeen!B7","v":"niet gebruikt 3"}]
["Naam","Voornaam","Rijksregisternr° (00.00.00-000.00)","Geboortedatum","Straat","Nr°/Bus","Postcode","Gemeente","Naam","Voornaam","Rijksregisternr° (00.00.00-000.00)","Straat","Nr°/Bus","Postcode","Gemeente","Controle"]
["vb. Evenepoel","vb. Remco","93.04.07-131.88",{"$f":"DATE((IF(VALUE((RIGHT(SUBSTITUTE(SUBSTITUTE(C3,\".\",\"\"),\"-\",\"\"),2)))=(97-(MOD(LEFT(SUBSTITUTE(SUBSTITUTE(C3,\".\",\"\"),\"-\",\"\"),9),97))),1900+(LEFT(SUBSTITUTE(SUBSTITUTE(C3,\".\",\"\"),\"-\",\"\"),2)),2000+(LEFT(SUBSTITUTE(SUBSTITUTE(C3,\".\",\"\"),\"-\",\"\"),2)))),(MID(SUBSTITUTE(SUBSTITUTE(C3,\".\",\"\"),\"-\",\"\"),3,2)),(MID(SUBSTITUTE(SUBSTITUTE(C3,\".\",\"\"),\"-\",\"\"),5,2)))","v":"1993-04-07"},"Vogelzangstraat","37/3",3540,{"$f":"_xlfn.XLOOKUP(G3,Postcode!$A$2:$A$2766,Postcode!$D$2:$D$2766,\"postcode klopt niet\",0)","v":"HERK-DE-STAD"},"vb. Evenepoel","vb. Patrick","66.03.17-144.48","Parklaan",23,3800,{"$f":"_xlfn.XLOOKUP(N3,Postcode!$A$2:$A$2766,Postcode!$D$2:$D$2766,\"postcode klopt niet\",0)","v":"SINT-TRUIDEN"}]
[null,null,null,{"$error":"#VALUE!"},null,null,null,{"$f":"_xlfn.XLOOKUP(G4,Postcode!$A$2:$A$2766,Postcode!$D$2:$D$2766,\"postcode klopt niet\",0)","v":"postcode klopt niet"},null,null,null,null,null,null,{"$f":"_xlfn.XLOOKUP(N4,Postcode!$A$2:$A$2766,Postcode!$D$2:$D$2766,\"postcode klopt niet\",0)","v":"postcode klopt niet"},{"$f":"COUNTA(A4,B4,D4,G4)","v":1}]
[null,null,null,{"$error":"#VALUE!"},null,null,null,{"$f":"_xlfn.XLOOKUP(G5,Postcode!$A$2:$A$2766,Postcode!$D$2:$D$2766,\"postcode klopt niet\",0)","v":"postcode klopt niet"},null,null,null,null,null,null,{"$f":"_xlfn.XLOOKUP(N5,Postcode!$A$2:$A$2766,Postcode!$D$2:$D$2766,\"postcode klopt niet\",0)","v":"postcode klopt niet"},{"$f":"COUNTA(A5,B5,D5,G5)","v":1}]
[null,null,null,{"$error":"#VALUE!"},null,null,null,{"$f":"_xlfn.XLOOKUP(G6,Postcode!$A$2:$A$2766,Postcode!$D$2:$D$2766,\"postcode klopt niet\",0)","v":"postcode klopt niet"},null,null,null,null,null,null,{"$f":"_xlfn.XLOOKUP(N6,Postcode!$A$2:$A$2766,Postcode!$D$2:$D$2766,\"postcode klopt niet\",0)","v":"postcode klopt niet"},1]
[null,null,null,{"$error":"#VALUE!"},null,null,null,{"$f":"_xlfn.XLOOKUP(G7,Postcode!$A$2:$A$2766,Postcode!$D$2:$D$2766,\"postcode klopt niet\",0)","v":"postcode klopt niet"},null,null,null,null,null,null,{"$f":"_xlfn.XLOOKUP(N7,Postcode!$A$2:$A$2766,Postcode!$D$2:$D$2766,\"postcode klopt niet\",0)","v":"postcode klopt niet"},1]
[null,null,null,{"$error":"#VALUE!"},null,null,null,{"$f":"_xlfn.XLOOKUP(G8,Postcode!$A$2:$A$2766,Postcode!$D$2:$D$2766,\"postcode klopt niet\",0)","v":"postcode klopt niet"},null,null,null,null,null,null,{"$f":"_xlfn.XLOOKUP(N8,Postcode!$A$2:$A$2766,Postcode!$D$2:$D$2766,\"postcode klopt niet\",0)","v":"postcode klopt niet"},1]
[null,null,null,{"$error":"#VALUE!"},null,null,null,{"$f":"_xlfn.XLOOKUP(G9,Postcode!$A$2:$A$2766,Postcode!$D$2:$D$2766,\"postcode klopt niet\",0)","v":"postcode klopt niet"},null,null,null,null,null,null,{"$f":"_xlfn.XLOOKUP(N9,Postcode!$A$2:$A$2766,Postcode!$D$2:$D$2766,\"postcode klopt niet\",0)","v":"postcode klopt niet"},1]
[null,null,null,{"$error":"#VALUE!"},null,null,null,{"$f":"_xlfn.XLOOKUP(G10,Postcode!$A$2:$A$2766,Postcode!$D$2:$D$2766,\"postcode klopt niet\",0)","v":"postcode klopt niet"},null,null,null,null,null,null,{"$f":"_xlfn.XLOOKUP(N10,Postcode!$A$2:$A$2766,Postcode!$D$2:$D$2766,\"postcode klopt niet\",0)","v":"postcode klopt niet"},1]
{"$rows_left_out":100}
{"sheet":"niet gebruikt 4","index":6,"n_rows":109,"n_cols":16,"rows_kept":109,"cut":false,"hidden":false,"merged":[[0,0,0,6]]}
["Gegevens Lid",null,null,null,null,null,null,null,null,null,null,null,null,null,null,{"$f":"Algemeen!B8","v":"niet gebruikt 4"}]
["Naam","Voornaam","Geboortedatum","Straat","Nr°/Bus","Postcode","Gemeente",null,null,null,null,null,null,null,null,"Controle"]
["vb. Evenepoel","vb. Remco","1990-04-03","Vogelzangstraat","37/3",3540,{"$f":"_xlfn.XLOOKUP(F3,Postcode!$A$2:$A$2766,Postcode!$D$2:$D$2766,\"postcode klopt niet\",0)","v":"HERK-DE-STAD"}]
[null,null,null,null,null,null,{"$f":"_xlfn.XLOOKUP(F4,Postcode!$A$2:$A$2766,Postcode!$D$2:$D$2766,\"postcode klopt niet\",0)","v":"postcode klopt niet"},null,null,null,null,null,null,null,null,{"$f":"COUNTA(A4,B4,C4,F4)","v":0}]
[null,null,null,null,null,null,{"$f":"_xlfn.XLOOKUP(F5,Postcode!$A$2:$A$2766,Postcode!$D$2:$D$2766,\"postcode klopt niet\",0)","v":"postcode klopt niet"},null,null,null,null,null,null,null,null,0]
[null,null,null,null,null,null,{"$f":"_xlfn.XLOOKUP(F6,Postcode!$A$2:$A$2766,Postcode!$D$2:$D$2766,\"postcode klopt niet\",0)","v":"postcode klopt niet"},null,null,null,null,null,null,null,null,0]
[null,null,null,null,null,null,{"$f":"_xlfn.XLOOKUP(F7,Postcode!$A$2:$A$2766,Postcode!$D$2:$D$2766,\"postcode klopt niet\",0)","v":"postcode klopt niet"},null,null,null,null,null,null,null,null,0]
[null,null,null,null,null,null,{"$f":"_xlfn.XLOOKUP(F8,Postcode!$A$2:$A$2766,Postcode!$D$2:$D$2766,\"postcode klopt niet\",0)","v":"postcode klopt niet"},null,null,null,null,null,null,null,null,0]
[null,null,null,null,null,null,{"$f":"_xlfn.XLOOKUP(F9,Postcode!$A$2:$A$2766,Postcode!$D$2:$D$2766,\"postcode klopt niet\",0)","v":"postcode klopt niet"},null,null,null,null,null,null,null,null,0]
[null,null,null,null,null,null,{"$f":"_xlfn.XLOOKUP(F10,Postcode!$A$2:$A$2766,Postcode!$D$2:$D$2766,\"postcode klopt niet\",0)","v":"postcode klopt niet"},null,null,null,null,null,null,null,null,0]
{"$rows_left_out":100}
{"sheet":"niet gebruikt 5","index":7,"n_rows":109,"n_cols":16,"rows_kept":109,"cut":false,"hidden":false,"merged":[[0,0,0,6]]}
["Gegevens Lid",null,null,null,null,null,null,null,null,null,null,null,null,null,null,{"$f":"Algemeen!B9","v":"niet gebruikt 5"}]
["Naam","Voornaam","Geboortedatum","Straat","Nr°/Bus","Postcode","Gemeente",null,null,null,null,null,null,null,null,"Controle"]
["vb. Evenepoel","vb. Remco","1990-04-03","Vogelzangstraat","37/3",3540,{"$f":"_xlfn.XLOOKUP(F3,Postcode!$A$2:$A$2766,Postcode!$D$2:$D$2766,\"postcode klopt niet\",0)","v":"HERK-DE-STAD"}]
[null,null,null,null,null,null,{"$f":"_xlfn.XLOOKUP(F4,Postcode!$A$2:$A$2766,Postcode!$D$2:$D$2766,\"postcode klopt niet\",0)","v":"postcode klopt niet"},null,null,null,null,null,null,null,null,{"$f":"COUNTA(A4,B4,C4,F4)","v":0}]
[null,null,null,null,null,null,{"$f":"_xlfn.XLOOKUP(F5,Postcode!$A$2:$A$2766,Postcode!$D$2:$D$2766,\"postcode klopt niet\",0)","v":"postcode klopt niet"},null,null,null,null,null,null,null,null,0]
[null,null,null,null,null,null,{"$f":"_xlfn.XLOOKUP(F6,Postcode!$A$2:$A$2766,Postcode!$D$2:$D$2766,\"postcode klopt niet\",0)","v":"postcode klopt niet"},null,null,null,null,null,null,null,null,0]
[null,null,null,null,null,null,{"$f":"_xlfn.XLOOKUP(F7,Postcode!$A$2:$A$2766,Postcode!$D$2:$D$2766,\"postcode klopt niet\",0)","v":"postcode klopt niet"},null,null,null,null,null,null,null,null,0]
[null,null,null,null,null,null,{"$f":"_xlfn.XLOOKUP(F8,Postcode!$A$2:$A$2766,Postcode!$D$2:$D$2766,\"postcode klopt niet\",0)","v":"postcode klopt niet"},null,null,null,null,null,null,null,null,0]
[null,null,null,null,null,null,{"$f":"_xlfn.XLOOKUP(F9,Postcode!$A$2:$A$2766,Postcode!$D$2:$D$2766,\"postcode klopt niet\",0)","v":"postcode klopt niet"},null,null,null,null,null,null,null,null,0]
[null,null,null,null,null,null,{"$f":"_xlfn.XLOOKUP(F10,Postcode!$A$2:$A$2766,Postcode!$D$2:$D$2766,\"postcode klopt niet\",0)","v":"postcode klopt niet"},null,null,null,null,null,null,null,null,0]
{"$rows_left_out":100}
{"sheet":"niet gebruikt 6","index":8,"n_rows":102,"n_cols":16,"rows_kept":102,"cut":false,"hidden":false,"merged":[[0,0,0,6]]}
["Gegevens Lid",null,null,null,null,null,null,null,null,null,null,null,null,null,null,{"$f":"Algemeen!B10","v":"niet gebruikt 6"}]
["Naam","Voornaam","Geboortedatum","Straat","Nr°/Bus","Postcode","Gemeente",null,null,null,null,null,null,null,null,"Controle"]
["vb. Evenepoel","vb. Remco","1990-04-03","Vogelzangstraat","37/3",3540,{"$f":"_xlfn.XLOOKUP(F3,Postcode!$A$2:$A$2766,Postcode!$D$2:$D$2766,\"postcode klopt niet\",0)","v":"HERK-DE-STAD"}]
[null,null,null,null,null,null,{"$f":"_xlfn.XLOOKUP(F4,Postcode!$A$2:$A$2766,Postcode!$D$2:$D$2766,\"postcode klopt niet\",0)","v":"postcode klopt niet"},null,null,null,null,null,null,null,null,{"$f":"COUNTA(A4,B4,C4,F4)","v":0}]
[null,null,null,null,null,null,{"$f":"_xlfn.XLOOKUP(F5,Postcode!$A$2:$A$2766,Postcode!$D$2:$D$2766,\"postcode klopt niet\",0)","v":"postcode klopt niet"},null,null,null,null,null,null,null,null,0]
[null,null,null,null,null,null,{"$f":"_xlfn.XLOOKUP(F6,Postcode!$A$2:$A$2766,Postcode!$D$2:$D$2766,\"postcode klopt niet\",0)","v":"postcode klopt niet"},null,null,null,null,null,null,null,null,0]
[null,null,null,null,null,null,{"$f":"_xlfn.XLOOKUP(F7,Postcode!$A$2:$A$2766,Postcode!$D$2:$D$2766,\"postcode klopt niet\",0)","v":"postcode klopt niet"},null,null,null,null,null,null,null,null,0]
[null,null,null,null,null,null,{"$f":"_xlfn.XLOOKUP(F8,Postcode!$A$2:$A$2766,Postcode!$D$2:$D$2766,\"postcode klopt niet\",0)","v":"postcode klopt niet"},null,null,null,null,null,null,null,null,0]
[null,null,null,null,null,null,{"$f":"_xlfn.XLOOKUP(F9,Postcode!$A$2:$A$2766,Postcode!$D$2:$D$2766,\"postcode klopt niet\",0)","v":"postcode klopt niet"},null,null,null,null,null,null,null,null,0]
[null,null,null,null,null,null,{"$f":"_xlfn.XLOOKUP(F10,Postcode!$A$2:$A$2766,Postcode!$D$2:$D$2766,\"postcode klopt niet\",0)","v":"postcode klopt niet"},null,null,null,null,null,null,null,null,0]
{"$rows_left_out":93}
{"sheet":"Postcode","index":9,"n_rows":2766,"n_cols":16,"rows_kept":2766,"cut":false,"hidden":false,"merged":[]}
["Postcode","Plaatsnaam","Deelgemeente","Hoofdgemeente","Provincie",null,null,null,null,null,null,null,null,null,null,"Postcode"]
[612,"Sinterklaas",null,"Sinterklaas"]
[1000,"Brussel","Neen","BRUSSEL","BRUSSEL"]
[1005,"Verenigde Vergadering van de Gemeenschappelijke ",null,"Verenigde Vergadering van de Gemeenschappelijke "]
[1006,"Raad van de Vlaamse Gemeenschapscommissie",null,"Raad van de Vlaamse Gemeenschapscommissie"]
[1007,"Assemblée de la Commission Communautaire Française",null,"Assemblée de la Commission Communautaire Française"]
[1008,"Kamer van Volksvertegenwoordigers",null,"Kamer van Volksvertegenwoordigers"]
[1009,"Belgische Senaat",null,"Belgische Senaat"]
[1011,"Vlaams Parlement",null,"Vlaams Parlement"]
[1012,"Parlement de la communauté française",null,"Parlement de la communauté française"]
{"$rows_left_out":2756}